Target
Mitogen-activated protein kinase 1
Ligand
BDBM365033
Substrate
Meas. Tech.
ERK-2 Enzymatic Assay
IC50
<0.020±n/a nM
Citation
 Kolesnikov, ADo, S Serine/threonine kinase inhibitors US Patent  US10278975 Publication Date 5/7/2019 
Target
Name:
Mitogen-activated protein kinase 1
Synonyms:
ERK2 Extracellular signal-regulated kinase 2 Extracellular signal-regulated kinase 2 (ERK2) MAPK 2 MK01_HUMAN Mitogen-activated protein kinase 1 (ERK-2) Mitogen-activated protein kinase 2 PRKM2 | p42-MAPK
Type:
Ser/Thr Protein Kinase
Mol. Mass.:
41392.76
Organism:
Homo sapiens (Human)
Description:
P28482
Residue:
360
  
Inhibitor
Name:
BDBM365033
Synonyms:
4-(3-(4-chlorobenzyl)-4,5- dihydro-3H-1,2,2a1,5- tetraazaacenaphthylen-7-yl)- N-(1-methyl-1H-pyrazol-5- yl)pyridin-2-amine US11376260, Example I-8R | US9867833, Compound I-8(R)
Type:
Small organic molecule
Emp. Form.:
C25H22ClN7
Mol. Mass.:
455.942
SMILES:
Cn1nccc1Nc1cc(ccn1)-c1cc2NC[C@@H](Cc3ccc(Cl)cc3)c3ncc(c1)n23
: