Target
Mitogen-activated protein kinase 1
Ligand
BDBM365117
Substrate
Meas. Tech.
ERK-2 Enzymatic Assay
IC50
11.4±n/a nM
Citation
 Kolesnikov, ADo, S Serine/threonine kinase inhibitors US Patent  US10278975 Publication Date 5/7/2019 
Target
Name:
Mitogen-activated protein kinase 1
Synonyms:
ERK2 Extracellular signal-regulated kinase 2 Extracellular signal-regulated kinase 2 (ERK2) MAPK 2 MK01_HUMAN Mitogen-activated protein kinase 1 (ERK-2) Mitogen-activated protein kinase 2 PRKM2 | p42-MAPK
Type:
Ser/Thr Protein Kinase
Mol. Mass.:
41392.76
Organism:
Homo sapiens (Human)
Description:
P28482
Residue:
360
  
Inhibitor
Name:
BDBM365117
Synonyms:
4-(3-(4-fluorobenzyl)-3,4- dihydro-5-oxa-1,2,2a1- triazaacenaphthylen-7-yl)-N- (1-methyl-1H-pyrazol-5- yl)pyridin-2-amine US11376260, Example I-57S | US9867833, Compound I-57(R)
Type:
Small organic molecule
Emp. Form.:
C24H20FN7O
Mol. Mass.:
441.4603
SMILES:
Cn1nccc1Nc1cc(ccn1)-c1cc2OC[C@@H](Cc3ccc(F)cc3)c3nnc(c1)n23
: