Target
Mitogen-activated protein kinase 1
Ligand
BDBM383374
Substrate
Meas. Tech.
ERK-2 Enzymatic Assay
IC50
0.082±n/a nM
Citation
 Kolesnikov, ADo, S Serine/threonine kinase inhibitors US Patent  US10278975 Publication Date 5/7/2019 
Target
Name:
Mitogen-activated protein kinase 1
Synonyms:
ERK2 Extracellular signal-regulated kinase 2 Extracellular signal-regulated kinase 2 (ERK2) MAPK 2 MK01_HUMAN Mitogen-activated protein kinase 1 (ERK-2) Mitogen-activated protein kinase 2 PRKM2 | p42-MAPK
Type:
Ser/Thr Protein Kinase
Mol. Mass.:
41392.76
Organism:
Homo sapiens (Human)
Description:
P28482
Residue:
360
  
Inhibitor
Name:
BDBM383374
Synonyms:
(S)-2-[4-(2-((1-methyl-1H- pyrazol-5- yl)amino)pyrimidin-4-yl)]- 8,9-dihydro-7H-6-oxa-1,2,2a1- triazabenzo[cd]azulen-9- yl)butanenitrile | US10278975, Compound I-105 S
Type:
Small organic molecule
Emp. Form.:
C21H21N9O
Mol. Mass.:
415.4511
SMILES:
CCC(C#N)[C@H]1CCOc2cc(cc3nnc1n23)-c1ccnc(Nc2ccnn2C)n1
: