Target
Mitogen-activated protein kinase 1
Ligand
BDBM365203
Substrate
Meas. Tech.
ERK-2 Enzymatic Assay
IC50
0.088±n/a nM
Citation
 Kolesnikov, ADo, S Serine/threonine kinase inhibitors US Patent  US10278975 Publication Date 5/7/2019 
Target
Name:
Mitogen-activated protein kinase 1
Synonyms:
ERK2 Extracellular signal-regulated kinase 2 Extracellular signal-regulated kinase 2 (ERK2) MAPK 2 MK01_HUMAN Mitogen-activated protein kinase 1 (ERK-2) Mitogen-activated protein kinase 2 PRKM2 | p42-MAPK
Type:
Ser/Thr Protein Kinase
Mol. Mass.:
41392.76
Organism:
Homo sapiens (Human)
Description:
P28482
Residue:
360
  
Inhibitor
Name:
BDBM365203
Synonyms:
N-(1-methyl-1H-pyrazol-5- yl)-4-(9-(2,2,2-trifluoroethyl)- 8,9-dihydro-7H-6-oxa- 1,2,2a1-triazabenzo[cd] azulen-4-yl)pyrimidin-2- amine US11376260, Example I-106S | US9867833, Compound I-106(R)
Type:
Small organic molecule
Emp. Form.:
C19H17F3N8O
Mol. Mass.:
430.3865
SMILES:
Cn1nccc1Nc1nccc(n1)-c1cc2OCC[C@@H](CC(F)(F)F)c3nnc(c1)n23
: