Target
Nuclear receptor ROR-gamma
Ligand
BDBM383443
Substrate
Meas. Tech.
In Vitro RORc Ligand Binding Assay
IC50
3.50±n/a nM
Citation
 Fauber, BCrawford, JJBronner, SMvan Niel, MBCridland, AGancia, EHurley, CKillen, JWard, S Pyridazine derivatives as RORc modulators US Patent  US10280144 Publication Date 5/7/2019 
Target
Name:
Nuclear receptor ROR-gamma
Synonyms:
NR1F3 Nuclear receptor ROR-gamma (RORC) RAR-related orphan receptor C (RORc) RORG RZRG Retinoid-related orphan receptor-gamma (RORc)
Type:
Enzyme Catalytic Domain
Mol. Mass.:
58218.40
Organism:
Homo sapiens (Human)
Description:
P51449
Residue:
518
  
Inhibitor
Name:
BDBM383443
Synonyms:
N-(((5R,8S)-3-(2,6- difluorophenyl)-9,9-dimethyl- 5,6,7,8-tetrahydro-5,8- methanocinnolin-8-yl)methyl)-N- ethyl-1- phenylmethanesulfonamide | US10280144, Compound 159
Type:
Small organic molecule
Emp. Form.:
C27H29F2N3O2S
Mol. Mass.:
497.6
SMILES:
CCN(C[C@@]12CC[C@@H](c3cc(nnc13)-c1c(F)cccc1F)C2(C)C)S(=O)(=O)Cc1ccccc1
: