Target
Rho-associated protein kinase 1
Ligand
BDBM25485
Substrate
ROCK I Substrate Peptide
Meas. Tech.
ROCK Kinase Inhibition Assay
pH
7.4±n/a
Temperature
295.15±n/a K
IC50
288±n/a nM
Citation
 Sehon, CAWang, GZViet, AQGoodman, KBDowdell, SEElkins, PASemus, SFEvans, CJolivette, LJKirkpatrick, RBDul, EKhandekar, SSYi, TWright, LLSmith, GKBehm, DJBentley, RDoe, CPHu, ELee, D Potent, selective and orally bioavailable dihydropyrimidine inhibitors of Rho kinase (ROCK1) as potential therapeutic agents for cardiovascular diseases. J Med Chem 51:6631-4 (2008)  
Target
Name:
Rho-associated protein kinase 1
Synonyms:
ROCK-I ROCK1_HUMAN Rho-associated protein kinase Rho-associated, coiled-coil-containing protein kinase 1 Rho-kinase (ROCK I) p160 ROCK-1 | p160ROCK
Type:
Serine/threonine-protein kinase
Mol. Mass.:
158156.77
Organism:
Homo sapiens (Human)
Description:
Q13464
Residue:
1354
  
Inhibitor
Name:
BDBM25485
Synonyms:
4-(4-fluorophenyl)-N-(1H-indazol-5-yl)-6-methyl-2-[3-(trifluoromethyl)phenyl]-1,4-dihydropyrimidine-5-carboxamide | Dihydropyrimidine, 14
Type:
Small organic molecule
Emp. Form.:
C26H19F4N5O
Mol. Mass.:
493.4556
SMILES:
CC1=C(C(NC(=N1)c1cccc(c1)C(F)(F)F)c1ccc(F)cc1)C(=O)Nc1ccc2[nH]ncc2c1
:
Substrate
Name:
ROCK I Substrate Peptide
Synonyms:
Type:
biotinylated peptide
Mol. Mass.:
2323.73
Organism:
Description:
Residue:
20