Target
Rho-associated protein kinase 1
Ligand
BDBM25490
Substrate
ROCK I Substrate Peptide
Meas. Tech.
ROCK Kinase Inhibition Assay
pH
7.4±n/a
Temperature
295.15±n/a K
IC50
68±n/a nM
Citation
 Sehon, CAWang, GZViet, AQGoodman, KBDowdell, SEElkins, PASemus, SFEvans, CJolivette, LJKirkpatrick, RBDul, EKhandekar, SSYi, TWright, LLSmith, GKBehm, DJBentley, RDoe, CPHu, ELee, D Potent, selective and orally bioavailable dihydropyrimidine inhibitors of Rho kinase (ROCK1) as potential therapeutic agents for cardiovascular diseases. J Med Chem 51:6631-4 (2008)  
Target
Name:
Rho-associated protein kinase 1
Synonyms:
ROCK-I ROCK1_HUMAN Rho-associated protein kinase Rho-associated, coiled-coil-containing protein kinase 1 Rho-kinase (ROCK I) p160 ROCK-1 | p160ROCK
Type:
Serine/threonine-protein kinase
Mol. Mass.:
158156.77
Organism:
Homo sapiens (Human)
Description:
Q13464
Residue:
1354
  
Inhibitor
Name:
BDBM25490
Synonyms:
Dihydropyrimidine, 19 | N-(1H-indazol-5-yl)-2-(4-methoxyphenyl)-6-methyl-4-(4-sulfamoylphenyl)-1,4-dihydropyrimidine-5-carboxamide
Type:
Small organic molecule
Emp. Form.:
C26H24N6O4S
Mol. Mass.:
516.572
SMILES:
COc1ccc(cc1)C1=NC(C)=C(C(N1)c1ccc(cc1)S(N)(=O)=O)C(=O)Nc1ccc2[nH]ncc2c1
:
Substrate
Name:
ROCK I Substrate Peptide
Synonyms:
Type:
biotinylated peptide
Mol. Mass.:
2323.73
Organism:
Description:
Residue:
20