Target
Lysine-specific demethylase 2B
Ligand
BDBM383546
Substrate
Meas. Tech.
KDM2B TR-FRET Assay
IC50
13.2±n/a nM
Citation
 Albrecht, BKCote, AGehling, VHsiao-Wei Tsui, VKiefer, JRLiang, JMagnuson, SNasveschuk, CGPastor, RRomero, FATaylor, AMZhang, B Therapeutic compounds and uses thereof US Patent  US10280149 Publication Date 5/7/2019 
Target
Name:
Lysine-specific demethylase 2B
Synonyms:
AA 1-650 FBL10 Homo sapiens lysine demethylase 2B (KDM2B) KDM2B Lysine-specific demethylase 2B NDY1 PCCX2
Type:
Enzyme Catalytic Domain
Mol. Mass.:
152658.35
Organism:
Homo sapiens (Human)
Description:
Q8NHM5
Residue:
1336
  
Inhibitor
Name:
BDBM383546
Synonyms:
2-[6-(1-cyclobutylpiperidine-3-carbonyl)-2-methoxy-1-naphthyl]acetonitrile | US10280149, Example 55
Type:
Small organic molecule
Emp. Form.:
C23H26N2O2
Mol. Mass.:
362.4647
SMILES:
COc1ccc2cc(ccc2c1CC#N)C(=O)C1CCCN(C1)C1CCC1
: