Target
Protein kinase C theta type
Ligand
BDBM25546
Substrate
PKC Peptide Substrate
Meas. Tech.
PKC theta IMAP Kinase Assay
pH
7.2±n/a
Temperature
295.15±n/a K
IC50
1400±500 nM
Citation
 Cole, DCAsselin, MBrennan, ACzerwinski, REllingboe, JWFitz, LGreco, RHuang, XJoseph-McCarthy, DKelly, MFKirisits, MLee, JLi, YMorgan, PStock, JRTsao, DHWissner, AYang, XChaudhary, D Identification, characterization and initial hit-to-lead optimization of a series of 4-arylamino-3-pyridinecarbonitrile as protein kinase C theta (PKCtheta) inhibitors. J Med Chem 51:5958-63 (2008)  
Target
Name:
Protein kinase C theta type
Synonyms:
KPCT_HUMAN PRKCT Protein kinase C theta type (PRKCQ) nPKC-theta
Type:
Serine/threonine-protein kinase
Mol. Mass.:
81878.04
Organism:
Homo sapiens (Human)
Description:
Full-length human PKC theta (Panvera Catalog No. P2996).
Residue:
706
  
Inhibitor
Name:
BDBM25546
Synonyms:
4-arylamino-3-pyridinecarbonitrile, 4d | 5-(3,4-dimethoxyphenyl)-4-[(3-fluorophenyl)amino]pyridine-3-carbonitrile
Type:
Small organic molecule
Emp. Form.:
C20H16FN3O2
Mol. Mass.:
349.3583
SMILES:
COc1ccc(cc1OC)-c1cncc(C#N)c1Nc1cccc(F)c1
:
Substrate
Name:
PKC Peptide Substrate
Synonyms:
Type:
Fluorescent peptide
Mol. Mass.:
2051.95
Organism:
Description:
Residue:
17
FAMRFARKGSLRQKNVH