Target
Serine/threonine-protein kinase B-raf [V600E]
Ligand
BDBM25561
Substrate
Dual specificity mitogen-activated protein kinase kinase 1
Meas. Tech.
In Vitro BRAF Kinase Assay
pH
7.2±n/a
Temperature
295.15±n/a K
IC50
3500±n/a nM
Citation
 Niculescu-Duvaz, IRoman, EWhittaker, SRFriedlos, FKirk, RScanlon, IJDavies, LCNiculescu-Duvaz, DMarais, RSpringer, CJ Novel inhibitors of the v-raf murine sarcoma viral oncogene homologue B1 (BRAF) based on a 2,6-disubstituted pyrazine scaffold. J Med Chem 51:3261-74 (2008)  
Target
Name:
Serine/threonine-protein kinase B-raf [V600E]
Synonyms:
B-RAF V600E B-Raf Protein Kinase Mutant (V600E) BRAF BRAF mutant V600E BRAF_HUMAN Protein mono-ADP-ribosyltransferase (PARP3) RAFB1 Serine/threonine-protein kinase B-raf (V600E) V-RAF murine sarcoma viral oncogene homologue B1 mutant (BRAF V600E)
Type:
Mol. Mass.:
84474.98
Organism:
Homo sapiens (Human)
Description:
P15056 V600E
Residue:
766
  
Inhibitor
Name:
BDBM25561
Synonyms:
2,6-Disubstituted Pyrazine, 1 N-(3-{6-[(3,4,5-trimethoxyphenyl)amino]pyrazin-2-yl}phenyl)acetamide
Type:
Small organic molecule
Emp. Form.:
C21H22N4O4
Mol. Mass.:
394.4238
SMILES:
COc1cc(Nc2cncc(n2)-c2cccc(NC(C)=O)c2)cc(OC)c1OC
:
Substrate
Name:
Dual specificity mitogen-activated protein kinase kinase 1
Synonyms:
GST fusion of MAP kinase kinase 1 MAP2K1 MP2K1_RABIT glutathione S-transferase-MAP kinase kinase 1
Type:
Other Protein Type
Mol. Mass.:
43453
Organism:
Oryctolagus cuniculus (rabbit)
Description:
Rabbit MEK1 was purchased from Millipore.
Residue:
393