Target
Isocitrate dehydrogenase [NADP] cytoplasmic [R132H]
Ligand
BDBM383831
Substrate
Meas. Tech.
IDH1-R132H and IDH1-R132C Enzymatic Assay
IC50
<100±n/a nM
Citation
 Lin, JEricsson, ACampbell, AGustafson, GWang, ZDiebold, RBAshwell, SLancia, Jr., DRCaravella, JALu, W Quinolinone pyrimidines compositions as mutant-isocitrate dehydrogenase inhibitors US Patent  US10280150 Publication Date 5/7/2019 
Target
Name:
Isocitrate dehydrogenase [NADP] cytoplasmic [R132H]
Synonyms:
Cytosolic NADP-isocitrate dehydrogenase (IDH1)(R132H) IDH1 R132H IDHC_HUMAN Isocitrate dehydrogenase 1 mutant (R132H) Isocitrate dehydrogenase [NADP] cytoplasmic (IDH1)(R132H) PICD
Type:
Protein
Mol. Mass.:
46641.74
Organism:
Homo sapiens (Human)
Description:
Human IDH1 R132H (SEQ ID No. 2 in patent). First three are removed. Google patent parsed wrong.
Residue:
414
  
Inhibitor
Name:
BDBM383831
Synonyms:
US10280150, Cmpd No I-114 | US10550099, Compound I-114
Type:
Small organic molecule
Emp. Form.:
C16H14ClN5O2
Mol. Mass.:
343.768
SMILES:
C[C@H](Nc1nccc(n1)C(N)=O)c1cc2cc(Cl)ccc2[nH]c1=O
: