Target
Serine/threonine-protein kinase B-raf [V600E]
Ligand
BDBM25617
Substrate
biotin-MEK
Meas. Tech.
In Vitro BRAF Kinase Assay
pH
7±n/a
Temperature
295.15±n/a K
IC50
13±n/a nM
Citation
 Tsai, JLee, JTWang, WZhang, JCho, HMamo, SBremer, RGillette, SKong, JHaass, NKSproesser, KLi, LSmalley, KSFong, DZhu, YLMarimuthu, ANguyen, HLam, BLiu, JCheung, IRice, JSuzuki, YLuu, CSettachatgul, CShellooe, RCantwell, JKim, SHSchlessinger, JZhang, KYWest, BLPowell, BHabets, GZhang, CIbrahim, PNHirth, PArtis, DRHerlyn, MBollag, G Discovery of a selective inhibitor of oncogenic B-Raf kinase with potent antimelanoma activity. Proc Natl Acad Sci U S A 105:3041-6 (2008)  
Target
Name:
Serine/threonine-protein kinase B-raf [V600E]
Synonyms:
B-RAF V600E B-Raf Protein Kinase Mutant (V600E) BRAF BRAF mutant V600E BRAF_HUMAN Protein mono-ADP-ribosyltransferase (PARP3) RAFB1 Serine/threonine-protein kinase B-raf (V600E) V-RAF murine sarcoma viral oncogene homologue B1 mutant (BRAF V600E)
Type:
Mol. Mass.:
84474.98
Organism:
Homo sapiens (Human)
Description:
P15056 V600E
Residue:
766
  
Inhibitor
Name:
BDBM25617
Synonyms:
N-[3-({5-chloro-1H-pyrrolo[2,3-b]pyridin-3-yl}carbonyl)-2,4-difluorophenyl]propane-1-sulfonamide | PLX4720
Type:
Small organic molecule
Emp. Form.:
C17H14ClF2N3O3S
Mol. Mass.:
413.826
SMILES:
CCCS(=O)(=O)Nc1ccc(F)c(C(=O)c2c[nH]c3ncc(Cl)cc23)c1F
:
Substrate
Name:
biotin-MEK
Synonyms:
Type:
biotinylated substrate
Mol. Mass.:
358.43
Organism:
Description:
Perkin-Elmer s AlphaScreen assay kit.
Residue:
3
NA