Target
Cystic fibrosis transmembrane conductance regulator
Ligand
BDBM160536
Substrate
Meas. Tech.
CFTR-YFP Assay
EC50
<10000±n/a nM
Citation
 Cole, BM Phthalazinone compounds and methods for the treatment of cystic fibrosis US Patent  US10280160 Publication Date 5/7/2019 
Target
Name:
Cystic fibrosis transmembrane conductance regulator
Synonyms:
ABCC7 CFTR Channel conductance-controlling ATPase | cAMP-dependent chloride channel
Type:
Enzyme Catalytic Domain
Mol. Mass.:
168171.30
Organism:
Homo sapiens (Human)
Description:
gi_90421313
Residue:
1480
  
Inhibitor
Name:
BDBM160536
Synonyms:
US10280160, Example 28. | US9682969, 28
Type:
Small organic molecule
Emp. Form.:
C31H29FN4O4
Mol. Mass.:
540.5848
SMILES:
CN(C(=O)Cn1nc(-c2cccc(F)c2)c2ccc(OC3CCCCC3)cc2c1=O)c1ccc2nc(C)oc2c1
: