Target
Cystic fibrosis transmembrane conductance regulator
Ligand
BDBM160545
Substrate
Meas. Tech.
CFTR-YFP Assay
EC50
<10000±n/a nM
Citation
 Cole, BM Phthalazinone compounds and methods for the treatment of cystic fibrosis US Patent  US10280160 Publication Date 5/7/2019 
Target
Name:
Cystic fibrosis transmembrane conductance regulator
Synonyms:
ABCC7 CFTR Channel conductance-controlling ATPase | cAMP-dependent chloride channel
Type:
Enzyme Catalytic Domain
Mol. Mass.:
168171.30
Organism:
Homo sapiens (Human)
Description:
gi_90421313
Residue:
1480
  
Inhibitor
Name:
BDBM160545
Synonyms:
US10280160, Example 30. | US9682969, 30
Type:
Small organic molecule
Emp. Form.:
C27H22ClFN4O4
Mol. Mass.:
520.939
SMILES:
CCOc1cc2c(cc1Cl)c(nn(CC(=O)N(C)c1ccc3nc(C)oc3c1)c2=O)-c1cccc(F)c1
: