Target
Serine/threonine-protein kinase B-raf
Ligand
BDBM25645
Substrate
GST-MEK
Meas. Tech.
B-Raf Activity Assay
pH
7.2±n/a
Temperature
295.15±n/a K
IC50
2.1±n/a nM
Citation
 Hansen, JDGrina, JNewhouse, BWelch, MTopalov, GLittman, NCallejo, MGloor, SMartinson, MLaird, EBrandhuber, BJVigers, GMorales, TWoessner, RRandolph, NLyssikatos, JOlivero, A Potent and selective pyrazole-based inhibitors of B-Raf kinase. Bioorg Med Chem Lett 18:4692-5 (2008)  
Target
Name:
Serine/threonine-protein kinase B-raf
Synonyms:
B-RAF B-Raf proto-oncogene serine/threonine-protein kinase BRAF1 RAFB1 v-Raf murine sarcoma viral oncogene homolog B1
Type:
Serine/threonine-protein kinase
Mol. Mass.:
84446.00
Organism:
Homo sapiens (Human)
Description:
P15056
Residue:
766
  
Inhibitor
Name:
BDBM25645
Synonyms:
4-{4-[(1Z)-1-(hydroxyimino)-2,3-dihydro-1H-inden-5-yl]-1-methyl-1H-pyrazol-3-yl}pyridin-2-amine | pyrazole-based inhibitor, 27
Type:
Small organic molecule
Emp. Form.:
C18H17N5O
Mol. Mass.:
319.3605
SMILES:
Cn1cc(c(n1)-c1ccnc(N)c1)-c1ccc2C(CCc2c1)N=O
:
Substrate
Name:
GST-MEK
Synonyms:
GST-kdMEK
Type:
Other Protein Type
Mol. Mass.:
358.43
Organism:
Description:
This protein is purified from bacterial cells expression mutant inactive MEK as a fusion protein with glutathione-S-transferase (GST-kdMEK).
Residue:
3
NA