Target
Glutamate receptor ionotropic, NMDA 1/2A
Ligand
BDBM383955
Substrate
Meas. Tech.
TBD
EC50
102±n/a nM
Citation
 Volgraf, MJiang, YVillemure, ESellers, BWu, GLu, A Pyridopyrimidinones and methods of use thereof US Patent  US10280165 Publication Date 5/7/2019 
Target
Name:
Glutamate receptor ionotropic, NMDA 1/2A
Synonyms:
Glutamate NMDA receptor; GRIN1/GRIN2A NR1/NR2A
Type:
Protein
Mol. Mass.:
Description:
Components:
This complex has 2 components.
Component 1
Name:
Glutamate receptor ionotropic, NMDA 1
Synonyms:
GRIN1 Glutamate [NMDA] receptor subunit zeta-1 N-methyl-D-aspartate receptor subunit NR1 NMDZ1_HUMAN | phencyclidine
Type:
Enzyme Catalytic Domain
Mol. Mass.:
105397.81
Organism:
Homo sapiens (Human)
Description:
Q05586
Residue:
938
  
Component 2
Name:
Glutamate receptor ionotropic, NMDA 2A
Synonyms:
GRIN2A Glutamate [NMDA] receptor Glutamate [NMDA] receptor subunit epsilon-1 NMDA receptor subtype 2A protein (NR2A) NMDE1_HUMAN hNR2A
Type:
Mol. Mass.:
165293.76
Organism:
Homo sapiens (Human)
Description:
Residue:
1464
  
Inhibitor
Name:
BDBM383955
Synonyms:
2-((3,5-dichloro-1H-pyrazol-1- yl)methyl)-7-methoxy-6-(2- methylcyclopropyl)-4H-pyrido[1,2- a]pyrimidin-4-one | US10280165, Example 55
Type:
Small organic molecule
Emp. Form.:
C18H19ClN4O2
Mol. Mass.:
358.822
SMILES:
COc1ccc2nc(Cn3nc(C)cc3Cl)cc(=O)n2c1C1CC1C
: