Target
Epoxide hydrolase B
Ligand
BDBM25744
Substrate
BDBM25726
Meas. Tech.
Mtb EHB Inhibition Assay
pH
7±n/a
Temperature
303.15±n/a K
IC50
31600±n/a nM
Citation
 Biswal, BKMorisseau, CGaren, GCherney, MMGaren, CNiu, CHammock, BDJames, MN The molecular structure of epoxide hydrolase B from Mycobacterium tuberculosis and its complex with a urea-based inhibitor. J Mol Biol 381:897-912 (2008)  
Target
Name:
Epoxide hydrolase B
Synonyms:
EPHB_MYCTO Mtb EHB
Type:
Enzyme
Mol. Mass.:
39285.78
Organism:
Mycobacterium tuberculosis
Description:
The His6-tagged Mtb EHB was expressed in E. coli and purified.
Residue:
356
  
Inhibitor
Name:
BDBM25744
Synonyms:
3-(1-acetylpiperidin-4-yl)-1-[4-(trifluoromethoxy)phenyl]urea US8501783, 1555 | Urea-based compound, 25
Type:
Small organic molecule
Emp. Form.:
C15H18F3N3O3
Mol. Mass.:
345.3169
SMILES:
CC(=O)N1CCC(CC1)NC(=O)Nc1ccc(OC(F)(F)F)cc1
:
Substrate
Name:
BDBM25726
Synonyms:
2-(6-methoxynaphthalen-2-yl)-2-({[(3-phenyloxiran-2-yl)methoxy]carbonyl}oxy)acetonitrile cyano(6-methoxy-naphthalen-2-yl)methyl trans-[(3-phenyloxiran-2-yl)methyl] carbonate
Type:
Small organic molecule
Emp. Form.:
C23H19NO5
Mol. Mass.:
389.4007
SMILES:
COc1ccc2cc(ccc2c1)C(OC(=O)OCC1OC1c1ccccc1)C#N
: