Target
Proto-oncogene Wnt-1
Ligand
BDBM383996
Substrate
Meas. Tech.
The screening assay for Wnt activity
IC50
3072±n/a nM
Citation
 KC, SKWallace, DMCao, JChiruta, CHood, J 2-(1H-indazol-3-yl)-3H-imidazo[4,5-B]pyridine and therapeutic uses thereof US Patent  US10280166 Publication Date 5/7/2019 
Target
Name:
Proto-oncogene Wnt-1
Synonyms:
INT1 WNT1 | WNT1_HUMAN
Type:
Enzyme Catalytic Domain
Mol. Mass.:
41006.01
Organism:
Homo sapiens (human)
Description:
P04628
Residue:
370
  
Inhibitor
Name:
BDBM383996
Synonyms:
US10280166, Compound 223
Type:
Small organic molecule
Emp. Form.:
C29H33N9
Mol. Mass.:
507.6326
SMILES:
CN1CCN(CC1)c1ccnc2[nH]c(nc12)-c1n[nH]c2ccc(cc12)-c1cncc(CN2CCCCC2)c1
: