Target
Proto-oncogene Wnt-1
Ligand
BDBM384024
Substrate
Meas. Tech.
The screening assay for Wnt activity
IC50
932±n/a nM
Citation
 KC, SKWallace, DMCao, JChiruta, CHood, J 2-(1H-indazol-3-yl)-3H-imidazo[4,5-B]pyridine and therapeutic uses thereof US Patent  US10280166 Publication Date 5/7/2019 
Target
Name:
Proto-oncogene Wnt-1
Synonyms:
INT1 WNT1 | WNT1_HUMAN
Type:
Enzyme Catalytic Domain
Mol. Mass.:
41006.01
Organism:
Homo sapiens (human)
Description:
P04628
Residue:
370
  
Inhibitor
Name:
BDBM384024
Synonyms:
US10280166, Compound 325
Type:
Small organic molecule
Emp. Form.:
C25H21N7S
Mol. Mass.:
451.546
SMILES:
CN(C)Cc1cncc(c1)-c1ccc2[nH]nc(-c3nc4c(ccnc4[nH]3)-c3cccs3)c2c1
: