Target
RNA-directed RNA polymerase
Ligand
BDBM384095
Substrate
Meas. Tech.
Measurement of Interferon Production in Human PBMC
EC50
46.0±n/a nM
Citation
 Bonfanti, JDoublet, FMEmbrechts, WFortin, JMMcGowan, DCMuller, PRaboisson, PJ Purine derivatives for the treatment of viral infections US Patent  US10280167 Publication Date 5/7/2019 
Target
Name:
RNA-directed RNA polymerase
Synonyms:
Hepatitis C virus NS5B RNA-dependent RNA polymerase | NS5B protein
Type:
Protein
Mol. Mass.:
25173.95
Organism:
Hepatitis C virus
Description:
Q8JXU8
Residue:
229
  
Inhibitor
Name:
BDBM384095
Synonyms:
US10280167, Example 24
Type:
Small organic molecule
Emp. Form.:
C18H18N8O
Mol. Mass.:
362.3885
SMILES:
Nc1nc(nc2n(Cc3ccc4CCNCc4c3)c(=O)[nH]c12)-c1ncc[nH]1
: