Target
Eukaryotic translation initiation factor 2-alpha kinase 3
Ligand
BDBM384121
Substrate
Meas. Tech.
pERK AlphaScreen Protocol
IC50
79.0±n/a nM
Citation
 Jones, PCzako, BCross, JLeonard, PMseeh, FParker, CA Heterocyclic inhibitors of PTPN11 US Patent  US10280171 Publication Date 5/7/2019 
Target
Name:
Eukaryotic translation initiation factor 2-alpha kinase 3
Synonyms:
E2AK3_HUMAN HsPEK PERK Pancreatic endoplasmic reticulum kinase (PERK)
Type:
Enzyme
Mol. Mass.:
125190.66
Organism:
Homo sapiens (Human)
Description:
Q9NZJ5
Residue:
1116
  
Inhibitor
Name:
BDBM384121
Synonyms:
3-(2,3-dichloro- phenyl)-6-(1,7-diaza- spiro[3.5]nonan-7- yl)-1H-pyrazolo[3,4- b]pyrazine US10851110, Example 7 | US11466017, Example 7
Type:
Small organic molecule
Emp. Form.:
C18H18Cl2N6
Mol. Mass.:
389.282
SMILES:
Clc1cccc(-c2n[nH]c3nc(cnc23)N2CCC3(CCN3)CC2)c1Cl
: