Target
Tyrosine-protein phosphatase non-receptor type 11 [E76K]
Ligand
BDBM384127
Substrate
Meas. Tech.
PTPN11 Enzymatic Assay
IC50
158±n/a nM
Citation
 Jones, PCzako, BCross, JLeonard, PMseeh, FParker, CA Heterocyclic inhibitors of PTPN11 US Patent  US10280171 Publication Date 5/7/2019 
Target
Name:
Tyrosine-protein phosphatase non-receptor type 11 [E76K]
Synonyms:
PTN11_HUMAN PTPN11 SHPTP2 Tyrosine-protein phosphatase non-receptor type 11 (PTPN11)(E76K)
Type:
Enzyme Catalytic Domain
Mol. Mass.:
68019.14
Organism:
Homo sapiens (Human)
Description:
Q06124[E76K]
Residue:
593
  
Inhibitor
Name:
BDBM384127
Synonyms:
(1-(3-(3,4-dichloro- phenyl)-1H- pyrazolo[3,4-b]- pyrazin-6-yl)-4- methylpiperidin-4-yl) methanamine US10851110, Example 13 | US11466017, Example 13
Type:
Small organic molecule
Emp. Form.:
C18H20Cl2N6
Mol. Mass.:
391.298
SMILES:
CC1(CN)CCN(CC1)c1cnc2c(n[nH]c2n1)-c1ccc(Cl)c(Cl)c1
: