Target
Tyrosine-protein phosphatase non-receptor type 11 [E76K]
Ligand
BDBM384141
Substrate
Meas. Tech.
PTPN11 Enzymatic Assay
IC50
80.0±n/a nM
Citation
 Jones, PCzako, BCross, JLeonard, PMseeh, FParker, CA Heterocyclic inhibitors of PTPN11 US Patent  US10280171 Publication Date 5/7/2019 
Target
Name:
Tyrosine-protein phosphatase non-receptor type 11 [E76K]
Synonyms:
PTN11_HUMAN PTPN11 SHPTP2 Tyrosine-protein phosphatase non-receptor type 11 (PTPN11)(E76K)
Type:
Enzyme Catalytic Domain
Mol. Mass.:
68019.14
Organism:
Homo sapiens (Human)
Description:
Q06124[E76K]
Residue:
593
  
Inhibitor
Name:
BDBM384141
Synonyms:
(1-(3-(2-chloro-3- methoxy phenyl)-1H- pyrazolo[3,4- b]pyrazin-6-yl)-4- methylpiperidin-4-yl) methanamine US10851110, Example 27 US11529347, Compound 39
Type:
Small organic molecule
Emp. Form.:
C19H23ClN6O
Mol. Mass.:
386.879
SMILES:
COc1cccc(-c2n[nH]c3nc(cnc23)N2CCC(C)(CN)CC2)c1Cl
: