Target
Eukaryotic translation initiation factor 2-alpha kinase 3
Ligand
BDBM384160
Substrate
Meas. Tech.
pERK AlphaScreen Protocol
IC50
343±n/a nM
Citation
 Jones, PCzako, BCross, JLeonard, PMseeh, FParker, CA Heterocyclic inhibitors of PTPN11 US Patent  US10280171 Publication Date 5/7/2019 
Target
Name:
Eukaryotic translation initiation factor 2-alpha kinase 3
Synonyms:
E2AK3_HUMAN HsPEK PERK Pancreatic endoplasmic reticulum kinase (PERK)
Type:
Enzyme
Mol. Mass.:
125190.66
Organism:
Homo sapiens (Human)
Description:
Q9NZJ5
Residue:
1116
  
Inhibitor
Name:
BDBM384160
Synonyms:
(R)-8-(3-(3-chloro-4- fluorophenyl)-1H- pyrazolo[3,4-b]- pyrazin-6-yl)-8-aza- spiro[4.5]decan-1- amine US10851110, Example 47 | US11466017, Example 47
Type:
Small organic molecule
Emp. Form.:
C20H22ClFN6
Mol. Mass.:
400.88
SMILES:
N[C@@H]1CCCC11CCN(CC1)c1cnc2c(n[nH]c2n1)-c1ccc(F)c(Cl)c1
: