Target
Tyrosine-protein phosphatase non-receptor type 11 [E76K]
Ligand
BDBM384205
Substrate
Meas. Tech.
PTPN11 Enzymatic Assay
IC50
509±n/a nM
Citation
 Jones, PCzako, BCross, JLeonard, PMseeh, FParker, CA Heterocyclic inhibitors of PTPN11 US Patent  US10280171 Publication Date 5/7/2019 
Target
Name:
Tyrosine-protein phosphatase non-receptor type 11 [E76K]
Synonyms:
PTN11_HUMAN PTPN11 SHPTP2 Tyrosine-protein phosphatase non-receptor type 11 (PTPN11)(E76K)
Type:
Enzyme Catalytic Domain
Mol. Mass.:
68019.14
Organism:
Homo sapiens (Human)
Description:
Q06124[E76K]
Residue:
593
  
Inhibitor
Name:
BDBM384205
Synonyms:
(R)-8-(3-(2-amino-5-chloropyridin-4-yl)-1H-pyrazolo[3,4-b]pyrazin-6-yl)-8-azaspiro[4.5]decan-1-amine US10851110, Example 125 | US11466017, Example 125
Type:
Small organic molecule
Emp. Form.:
C19H23ClN8
Mol. Mass.:
398.893
SMILES:
N[C@@H]1CCCC11CCN(CC1)c1cnc2c(n[nH]c2n1)-c1cc(N)ncc1Cl
: