Target
Lanosterol 14-alpha demethylase
Ligand
BDBM25812
Substrate
BDBM10852
Meas. Tech.
Ligand Binding Assay
pH
7.5±n/a
Temperature
310.15±n/a K
Kd
7500±n/a nM
Comments
Kd from 5 to 10 uM.
Citation
 Podust, LMvon Kries, JPEddine, ANKim, YYermalitskaya, LVKuehne, ROuellet, HWarrier, TAlteköster, MLee, JSRademann, JOschkinat, HKaufmann, SHWaterman, MR Small-molecule scaffolds for CYP51 inhibitors identified by high-throughput screening and defined by X-ray crystallography. Antimicrob Agents Chemother 51:3915-23 (2007)  
Target
Name:
Lanosterol 14-alpha demethylase
Synonyms:
CP51_MYCTO Cytochrome P450 51(CYP51) P450-LIA1 cyp51
Type:
Monooxygenase; oxidoreductase
Mol. Mass.:
50869.67
Organism:
Mycobacterium tuberculosis (strain CDC 1551 / Oshkosh)
Description:
P9WPP8
Residue:
451
  
Inhibitor
Name:
BDBM25812
Synonyms:
Compound 0466-0151 N-(4-aminophenyl)-4-chlorobenzenesulfonamide
Type:
Small organic molecule
Emp. Form.:
C12H11ClN2O2S
Mol. Mass.:
282.746
SMILES:
Nc1ccc(NS(=O)(=O)c2ccc(Cl)cc2)cc1
:
Substrate