Target
Lanosterol 14-alpha demethylase [F78L]
Ligand
BDBM25816
Substrate
BDBM10852
Meas. Tech.
Ligand Binding Assay
pH
7.5±n/a
Temperature
310.15±n/a K
Kd
23200±n/a nM
Citation
 Podust, LMvon Kries, JPEddine, ANKim, YYermalitskaya, LVKuehne, ROuellet, HWarrier, TAlteköster, MLee, JSRademann, JOschkinat, HKaufmann, SHWaterman, MR Small-molecule scaffolds for CYP51 inhibitors identified by high-throughput screening and defined by X-ray crystallography. Antimicrob Agents Chemother 51:3915-23 (2007)  
Target
Name:
Lanosterol 14-alpha demethylase [F78L]
Synonyms:
CP51_MYCTO Mbt CYP51 active site mutant | cyp51
Type:
Enzyme
Mol. Mass.:
50835.66
Organism:
Mycobacterium tuberculosis
Description:
The recombinant Mbt CYP51 (F78L) expressed in E. coli was used in binding assay.
Residue:
451
  
Inhibitor
Name:
BDBM25816
Synonyms:
2-(2,1,3-benzothiadiazole-4-sulfonamido)-2-phenyl-N-(pyridin-4-yl)acetamide | Compound C481-0205 (BSPPA)
Type:
Small organic molecule
Emp. Form.:
C19H15N5O3S2
Mol. Mass.:
425.484
SMILES:
O=C(Nc1ccncc1)C(NS(=O)(=O)c1cccc2nsnc12)c1ccccc1
:
Substrate