Target
Dihydrofolate reductase
Ligand
BDBM25820
Substrate
BDBM18044
Meas. Tech.
DHFR Inhibition Assay
pH
7±n/a
Temperature
298.15±n/a K
IC50
1250±6 nM
Citation
 Bolstad, DBBolstad, ESFrey, KMWright, DLAnderson, AC Structure-based approach to the development of potent and selective inhibitors of dihydrofolate reductase from cryptosporidium. J Med Chem 51:6839-52 (2008)  
Target
Name:
Dihydrofolate reductase
Synonyms:
DHFR Dihydrofolate reductase (DHFR) | Tetrahydrofolate dehydrogenase
Type:
Enzyme
Mol. Mass.:
21453.99
Organism:
Homo sapiens (Human)
Description:
Recombinant human DHFR.
Residue:
187
  
Inhibitor
Name:
BDBM25820
Synonyms:
5-{3-[3-(2,6-dimethylphenyl)-5-methoxyphenyl]but-1-yn-1-yl}-6-methylpyrimidine-2,4-diamine propargyl-based inhibitor, 10c (+/-)
Type:
Small organic molecule
Emp. Form.:
C24H26N4O
Mol. Mass.:
386.4894
SMILES:
COc1cc(cc(c1)-c1c(C)cccc1C)C(C)C#Cc1c(C)nc(N)nc1N
:
Substrate
Name:
BDBM18044
Synonyms:
(2S)-2-[(4-{[(2-amino-4-oxo-1,4,7,8-tetrahydropteridin-6-yl)methyl]amino}phenyl)formamido]pentanedioic acid dihydrofolic acid
Type:
Small organic molecule
Emp. Form.:
C19H21N7O6
Mol. Mass.:
443.4133
SMILES:
Nc1nc2NCC(CNc3ccc(cc3)C(=O)N[C@@H](CCC(O)=O)C(O)=O)=Nc2c(=O)[nH]1
: