Target
17-beta-hydroxysteroid dehydrogenase type 1
Ligand
BDBM25851
Substrate
BDBM17289
Meas. Tech.
Inhibition of 17beta-HSD1
pH
7±n/a
Temperature
310.15±n/a K
IC50
173±n/a nM
Citation
 Bey, EMarchais-Oberwinkler, SWerth, RNegri, MAl-Soud, YAKruchten, POster, AFrotscher, MBirk, BHartmann, RW Design, synthesis, biological evaluation and pharmacokinetics of bis(hydroxyphenyl) substituted azoles, thiophenes, benzenes, and aza-benzenes as potent and selective nonsteroidal inhibitors of 17beta-hydroxysteroid dehydrogenase type 1 (17beta-HSD1). J Med Chem 51:6725-39 (2008)  
Target
Name:
17-beta-hydroxysteroid dehydrogenase type 1
Synonyms:
17-beta-HSD 1 17-beta-hydroxysteroid dehydrogenase type 1 20-alpha-HSD E17KSR EDH17B1 EDHB17 Estradiol 17-beta-dehydrogenase 1 (17beta-HSD1) Placental 17-beta-hydroxysteroid dehydrogenase | SDR28C1
Type:
Enzyme
Mol. Mass.:
34945.13
Organism:
Homo sapiens (Human)
Description:
P14061
Residue:
328
  
Inhibitor
Name:
BDBM25851
Synonyms:
3-[5-(3-hydroxyphenyl)thiophen-2-yl]phenol | hydroxyphenyl substituted thiophene, 23
Type:
Small organic molecule
Emp. Form.:
C16H12O2S
Mol. Mass.:
268.33
SMILES:
Oc1cccc(c1)-c1ccc(s1)-c1cccc(O)c1
:
Substrate
Name:
BDBM17289
Synonyms:
(1S,10R,11S,15S)-5-hydroxy-15-methyltetracyclo[8.7.0.0^{2,7}.0^{11,15}]heptadeca-2,4,6-trien-14-one Estrone Estrone, 15 Kestrone Unigen [2,4,6,7-3H]-Estrone | folliculin
Type:
Steroid
Emp. Form.:
C18H22O2
Mol. Mass.:
270.3661
SMILES:
[H][C@@]12CCC(=O)[C@@]1(C)CC[C@]1([H])c3ccc(O)cc3CC[C@@]21[H]
: