Target
17-beta-hydroxysteroid dehydrogenase type 1
Ligand
BDBM25867
Substrate
BDBM17289
Meas. Tech.
Inhibition of 17beta-HSD1
IC50
201±n/a nM
Citation
 Bey, EMarchais-Oberwinkler, SWerth, RNegri, MAl-Soud, YAKruchten, POster, AFrotscher, MBirk, BHartmann, RW Design, synthesis, biological evaluation and pharmacokinetics of bis(hydroxyphenyl) substituted azoles, thiophenes, benzenes, and aza-benzenes as potent and selective nonsteroidal inhibitors of 17beta-hydroxysteroid dehydrogenase type 1 (17beta-HSD1). J Med Chem 51:6725-39 (2008)  
Target
Name:
17-beta-hydroxysteroid dehydrogenase type 1
Synonyms:
17-beta-HSD 1 17-beta-hydroxysteroid dehydrogenase type 1 20-alpha-HSD E17KSR EDH17B1 EDHB17 Estradiol 17-beta-dehydrogenase 1 (17beta-HSD1) Placental 17-beta-hydroxysteroid dehydrogenase | SDR28C1
Type:
Enzyme
Mol. Mass.:
34945.13
Organism:
Homo sapiens (Human)
Description:
P14061
Residue:
328
  
Inhibitor
Name:
BDBM25867
Synonyms:
3-[6-(3-hydroxyphenyl)-1,2,4,5-tetrazin-3-yl]phenol hydroxyphenyl substituted tetrazine, 39
Type:
Small organic molecule
Emp. Form.:
C14H10N4O2
Mol. Mass.:
266.2548
SMILES:
Oc1cccc(c1)-c1nnc(nn1)-c1cccc(O)c1
:
Substrate
Name:
BDBM17289
Synonyms:
(1S,10R,11S,15S)-5-hydroxy-15-methyltetracyclo[8.7.0.0^{2,7}.0^{11,15}]heptadeca-2,4,6-trien-14-one Estrone Estrone, 15 Kestrone Unigen [2,4,6,7-3H]-Estrone | folliculin
Type:
Steroid
Emp. Form.:
C18H22O2
Mol. Mass.:
270.3661
SMILES:
[H][C@@]12CCC(=O)[C@@]1(C)CC[C@]1([H])c3ccc(O)cc3CC[C@@]21[H]
: