Target
17-beta-hydroxysteroid dehydrogenase type 2
Ligand
BDBM25839
Substrate
[2,4,6,7-3H]-E2
Meas. Tech.
Inhibition of 17beta-HSD2
IC50
602±n/a nM
Citation
 Bey, EMarchais-Oberwinkler, SWerth, RNegri, MAl-Soud, YAKruchten, POster, AFrotscher, MBirk, BHartmann, RW Design, synthesis, biological evaluation and pharmacokinetics of bis(hydroxyphenyl) substituted azoles, thiophenes, benzenes, and aza-benzenes as potent and selective nonsteroidal inhibitors of 17beta-hydroxysteroid dehydrogenase type 1 (17beta-HSD1). J Med Chem 51:6725-39 (2008)  
Target
Name:
17-beta-hydroxysteroid dehydrogenase type 2
Synonyms:
17-beta-Hydroxysteroid Dehydrogenase 2 (17-beta-HSD2) 20-alpha-HSD EDH17B2 Estradiol 17-beta-dehydrogenase 2 (17beta-HSD2) Microsomal 17-beta-hydroxysteroid dehydrogenas Testosterone 17-beta-dehydrogenase
Type:
Oxidoreductase; single-pass type II membrane protein
Mol. Mass.:
42795.29
Organism:
Homo sapiens (Human)
Description:
Enzyme was partially purified from human placenta.
Residue:
387
  
Inhibitor
Name:
BDBM25839
Synonyms:
3-[5-(3-hydroxyphenyl)-1,2,4-thiadiazol-3-yl]phenol | hydroxyphenyl substituted thiadiazole, 11
Type:
Small organic molecule
Emp. Form.:
C14H10N2O2S
Mol. Mass.:
270.306
SMILES:
Oc1cccc(c1)-c1nsc(n1)-c1cccc(O)c1
:
Substrate
Name:
BDBM17292
Synonyms:
(1S,10R,11S,14S,15S)-15-methyltetracyclo[8.7.0.0^{2,7}.0^{11,15}]heptadeca-2,4,6-triene-5,14-diol 17α-ethinylestradiol CHEMBL135 ESTRADIOL Ovocyclin US9040509, E2 US9561238, E2 [2,4,6,7-3H]-E2 [3H]]estradiol
Type:
Steroid
Emp. Form.:
C18H24O2
Mol. Mass.:
272.382
SMILES:
[H][C@@]12CC[C@H](O)[C@@]1(C)CC[C@]1([H])c3ccc(O)cc3CC[C@@]21[H]
: