Target
Tyrosine-protein kinase BTK
Ligand
BDBM384254
Substrate
Meas. Tech.
In Vitro BTK Kinase Activity
IC50
550±n/a nM
Citation
 Friedman, MMCox, PFrank, KEHoemann, MZOsuma, AWilson, NSXu, XCusack, KHuntley, RHerold, JM Heterocyclic kinase inhibitors US Patent  US10280184 Publication Date 5/7/2019 
Target
Name:
Tyrosine-protein kinase BTK
Synonyms:
AGMX1 Agammaglobulinaemia tyrosine kinase B cell progenitor kinase BPK BTK_HUMAN Tyrosine Kinase BTK Tyrosine-protein kinase BTK (BTK)
Type:
Enzyme
Mol. Mass.:
76289.95
Organism:
Homo sapiens (Human)
Description:
Q06187
Residue:
659
  
Inhibitor
Name:
BDBM384254
Synonyms:
US10280184, Example F.1.19
Type:
Small organic molecule
Emp. Form.:
C21H24N8O2
Mol. Mass.:
420.4677
SMILES:
C=CC(=O)N1CCC(C1)c1cn2ncnc2c(Nc2ccc(nc2)N2CCOCC2)n1
: