Target
D-amino-acid oxidase
Ligand
BDBM50431086
Substrate
Meas. Tech.
Enzyme Assay
IC50
10.00±n/a nM
Citation
 Farnaby, WFieldhouse, CHazel, KKerr, CKinsella, NLivermore, DMerchant, KMiller, D Pyridazinone compounds and their use as DAAO inhibitors US Patent  US9931340 Publication Date 4/3/2018 
Target
Name:
D-amino-acid oxidase
Synonyms:
D-amino-acid oxidase (DAAO) DAMOX OXDA_HUMAN
Type:
Homodimer
Mol. Mass.:
39476.06
Organism:
Homo sapiens (Human)
Description:
P14920
Residue:
347
  
Inhibitor
Name:
BDBM50431086
Synonyms:
CHEMBL2338800 US10463663, Example 2 US9212147, 212 US9931340, Example 2
Type:
Small organic molecule
Emp. Form.:
C12H11FN2O2
Mol. Mass.:
234.2263
SMILES:
Oc1cc(CCc2ccc(F)cc2)n[nH]c1=O
: