Target
D-amino-acid oxidase
Ligand
BDBM50431085
Substrate
Meas. Tech.
Enzyme Assay
IC50
19.0±n/a nM
Citation
 Farnaby, WFieldhouse, CHazel, KKerr, CKinsella, NLivermore, DMerchant, KMiller, D Pyridazinone compounds and their use as DAAO inhibitors US Patent  US9931340 Publication Date 4/3/2018 
Target
Name:
D-amino-acid oxidase
Synonyms:
D-amino-acid oxidase (DAAO) DAMOX OXDA_HUMAN
Type:
Homodimer
Mol. Mass.:
39476.06
Organism:
Homo sapiens (Human)
Description:
P14920
Residue:
347
  
Inhibitor
Name:
BDBM50431085
Synonyms:
CHEMBL2338801 US10463663, Example 36 US9212147, 12 US9931340, Example 36
Type:
Small organic molecule
Emp. Form.:
C13H11F3N2O2
Mol. Mass.:
284.2338
SMILES:
Oc1cc(CCc2ccc(cc2)C(F)(F)F)n[nH]c1=O
: