Target
D-amino-acid oxidase
Ligand
BDBM210814
Substrate
Meas. Tech.
Enzyme Assay
IC50
130±n/a nM
Citation
 Farnaby, WFieldhouse, CHazel, KKerr, CKinsella, NLivermore, DMerchant, KMiller, D Pyridazinone compounds and their use as DAAO inhibitors US Patent  US9931340 Publication Date 4/3/2018 
Target
Name:
D-amino-acid oxidase
Synonyms:
D-amino-acid oxidase (DAAO) DAMOX OXDA_HUMAN
Type:
Homodimer
Mol. Mass.:
39476.06
Organism:
Homo sapiens (Human)
Description:
P14920
Residue:
347
  
Inhibitor
Name:
BDBM210814
Synonyms:
US10463663, Example 52 US9290456, 52 | US9931340, Example 52
Type:
Small organic molecule
Emp. Form.:
C12H12FN3O2
Mol. Mass.:
249.241
SMILES:
CN(Cc1ccc(F)cc1)c1cc(O)c(=O)[nH]n1
: