Target
Carbonic anhydrase 6
Ligand
BDBM25897
Substrate
BDBM10856
Meas. Tech.
CA Inhibition Assay
Ki
8250±n/a nM
Citation
 Temperini, CCecchi, AScozzafava, ASupuran, CT Carbonic anhydrase inhibitors. Interaction of indapamide and related diuretics with 12 mammalian isozymes and X-ray crystallographic studies for the indapamide-isozyme II adduct. Bioorg Med Chem Lett 18:2567-73 (2008)  
Target
Name:
Carbonic anhydrase 6
Synonyms:
CA-VI CAH6_HUMAN Carbonic Anhydrase VI Carbonic anhydrase 6 Carbonic anhydrase 6 (CA-VI) Salivary carbonic anhydrase | Secreted carbonic anhydrase
Type:
Enzyme
Mol. Mass.:
35371.40
Organism:
Homo sapiens (Human)
Description:
P23280
Residue:
308
  
Inhibitor
Name:
BDBM25897
Synonyms:
1,1-dioxo-6-(trifluoromethyl)-3,4-dihydro-2H-1,2,4-benzothiadiazine-7-sulfonamide Diuredemina Hydroflumethiazide | cid_3647
Type:
Small organic molecule
Emp. Form.:
C8H8F3N3O4S2
Mol. Mass.:
331.292
SMILES:
NS(=O)(=O)c1cc2c(NCNS2(=O)=O)cc1C(F)(F)F
:
Substrate
Name:
BDBM10856
Synonyms:
Carbon Dioxide | methanedione
Type:
Small organic molecule
Emp. Form.:
CO2
Mol. Mass.:
44.0095
SMILES:
O=C=O
: