Target
Leucine-rich repeat serine/threonine-protein kinase 2 [G2019S]
Ligand
BDBM384373
Substrate
Meas. Tech.
Biochemical Assay
IC50
<30±n/a nM
Citation
 Estrada, AAFeng, JALyssikatos, JPSweeney, ZKde Vicente Fidalgo, J Compounds, compositions, and methods US Patent  US9932325 Publication Date 4/3/2018 
Target
Name:
Leucine-rich repeat serine/threonine-protein kinase 2 [G2019S]
Synonyms:
LRRK2 LRRK2_HUMAN Leucine-rich repeat serine/threonine-protein kinase 2 (LRRK2)(G2019S) PARK8
Type:
Mol. Mass.:
286143.23
Organism:
Homo sapiens (Human)
Description:
Q5S007(G2019S)
Residue:
2527
  
Inhibitor
Name:
BDBM384373
Synonyms:
US10590114, No. 60 US11591316, Compound 60 | US9932325, Example 60
Type:
Small organic molecule
Emp. Form.:
C15H17ClN6O
Mol. Mass.:
332.788
SMILES:
Cc1nn(cc1Nc1ncc(Cl)c(OC2CC2)n1)C(C)(C)C#N
: