Target
Leucine-rich repeat serine/threonine-protein kinase 2 [G2019S]
Ligand
BDBM50448118
Substrate
Meas. Tech.
Biochemical Assay
IC50
<30±n/a nM
Citation
 Estrada, AAFeng, JALyssikatos, JPSweeney, ZKde Vicente Fidalgo, J Compounds, compositions, and methods US Patent  US9932325 Publication Date 4/3/2018 
Target
Name:
Leucine-rich repeat serine/threonine-protein kinase 2 [G2019S]
Synonyms:
LRRK2 LRRK2_HUMAN Leucine-rich repeat serine/threonine-protein kinase 2 (LRRK2)(G2019S) PARK8
Type:
Mol. Mass.:
286143.23
Organism:
Homo sapiens (Human)
Description:
Q5S007(G2019S)
Residue:
2527
  
Inhibitor
Name:
BDBM50448118
Synonyms:
CHEMBL3122113 US11111235, No. 80 US9932325, Example 80
Type:
Small organic molecule
Emp. Form.:
C14H16F3N7
Mol. Mass.:
339.3189
SMILES:
CNc1nc(Nc2cn(nc2C)C(C)(C)C#N)ncc1C(F)(F)F
: