Target
Leucine-rich repeat serine/threonine-protein kinase 2 [G2019S]
Ligand
BDBM384472
Substrate
Meas. Tech.
Biochemical Assay
IC50
<30±n/a nM
Citation
 Estrada, AAFeng, JALyssikatos, JPSweeney, ZKde Vicente Fidalgo, J Compounds, compositions, and methods US Patent  US9932325 Publication Date 4/3/2018 
Target
Name:
Leucine-rich repeat serine/threonine-protein kinase 2 [G2019S]
Synonyms:
LRRK2 LRRK2_HUMAN Leucine-rich repeat serine/threonine-protein kinase 2 (LRRK2)(G2019S) PARK8
Type:
Mol. Mass.:
286143.23
Organism:
Homo sapiens (Human)
Description:
Q5S007(G2019S)
Residue:
2527
  
Inhibitor
Name:
BDBM384472
Synonyms:
US10590114, No. 158 US11591316, Compound 158 | US9932325, Example 158
Type:
Small organic molecule
Emp. Form.:
C16H20BrN7O
Mol. Mass.:
406.28
SMILES:
CCNc1nc(Nc2cc(nn2C2CC2)N2CCCC2=O)ncc1Br
: