Target
Tyrosine-protein kinase TXK
Ligand
BDBM384543
Substrate
Meas. Tech.
Enzymatic Activity In Vitro Assays
IC50
0.300±n/a nM
Citation
 Owens, THill, RJ Benzimidazole derivatives as RLK and ITK inhibitors US Patent  US9932329 Publication Date 4/3/2018 
Target
Name:
Tyrosine-protein kinase TXK
Synonyms:
PTK4 RLK TXK Tyrosine-protein kinase TXK (TXK)
Type:
Protein
Mol. Mass.:
61268.80
Organism:
Homo sapiens (Human)
Description:
P42681
Residue:
527
  
Inhibitor
Name:
BDBM384543
Synonyms:
(R)-N-(1-((1-acryloylpyrrolidin-2-yl)methyl)-5-(((2-hydroxy-2-methylpropyl)amino)methyl)-1H-benzo[d]imidazol-2-yl)-5-(oxazol-5-yl)thiophene-2-carboxamide | US9932329, Cpd # 14
Type:
Small organic molecule
Emp. Form.:
C28H32N6O4S
Mol. Mass.:
548.656
SMILES:
CC(C)(O)CNCc1ccc2n(C[C@H]3CCCN3C(=O)C=C)c(NC(=O)c3ccc(s3)-c3cnco3)nc2c1
: