Target
Carbonic anhydrase 7
Ligand
BDBM25918
Substrate
BDBM10856
Meas. Tech.
CA Inhibition Assay
Ki
68±n/a nM
Citation
 Güzel, OInnocenti, AScozzafava, ASalman, AParkkila, SHilvo, MSupuran, CT Carbonic anhydrase inhibitors: synthesis and inhibition studies against mammalian isoforms I-XV with a series of 2-(hydrazinocarbonyl)-3-substituted-phenyl-1H-indole-5-sulfonamides. Bioorg Med Chem 16:9113-20 (2008)  
Target
Name:
Carbonic anhydrase 7
Synonyms:
CA-VII CAH7_HUMAN Carbonic anhydrase Carbonic anhydrase VII (CA VII)
Type:
Enzyme
Mol. Mass.:
29664.11
Organism:
Homo sapiens (Human)
Description:
Human cloned isozyme.
Residue:
264
  
Inhibitor
Name:
BDBM25918
Synonyms:
2-(hydrazinecarbonyl)-3-(2,3,4,5,6-pentafluorophenyl)-1H-indole-5-sulfonamide indole sulfonamide, 8n
Type:
Small organic molecule
Emp. Form.:
C15H9F5N4O3S
Mol. Mass.:
420.314
SMILES:
NNC(=O)c1[nH]c2ccc(cc2c1-c1c(F)c(F)c(F)c(F)c1F)S(N)(=O)=O
:
Substrate
Name:
BDBM10856
Synonyms:
Carbon Dioxide | methanedione
Type:
Small organic molecule
Emp. Form.:
CO2
Mol. Mass.:
44.0095
SMILES:
O=C=O
: