Target
Cannabinoid receptor 2
Ligand
BDBM259977
Substrate
Meas. Tech.
cAMP Assay
Temperature
310.15±n/a K
EC50
20±n/a nM
Comments
extracted
Citation
 Grether, UKimbara, ANettekoven, MRicklin, FRoever, SRogers-Evans, MSchulz-Gasch, T Pyrazol derivatives US Patent  US9694012 Publication Date 7/4/2017 
Target
Name:
Cannabinoid receptor 2
Synonyms:
CANNABINOID CB2 CB2 CB2B CNR2_HUMAN Cannabinoid CB2 receptor Cannabinoid receptor 2 (CB2R) | hCB2
Type:
G Protein-Coupled Receptor (GPCR)
Mol. Mass.:
39690.94
Organism:
Homo sapiens (Human)
Description:
P34972
Residue:
360
  
Inhibitor
Name:
BDBM259977
Synonyms:
US9512132, 13
Type:
Small organic molecule
Emp. Form.:
C16H21F2N5O2S
Mol. Mass.:
385.432
SMILES:
CC(C)(C)c1nc(N2CCC(F)(F)C2)c2cnn(C3CS(=O)(=O)C3)c2n1
: