Target
Cannabinoid receptor 1
Ligand
BDBM259996
Substrate
Meas. Tech.
cAMP Assay
Temperature
310.15±n/a K
EC50
>10000±n/a nM
Comments
extracted
Citation
 Grether, UKimbara, ANettekoven, MRicklin, FRoever, SRogers-Evans, MSchulz-Gasch, T Pyrazol derivatives US Patent  US9694012 Publication Date 7/4/2017 
Target
Name:
Cannabinoid receptor 1
Synonyms:
CANN6 CB-R CNR CNR1_HUMAN Cannabinoid receptor Cannabinoid receptor 1 (brain)
Type:
G Protein-Coupled Receptor (GPCR)
Mol. Mass.:
52868.96
Organism:
Homo sapiens (Human)
Description:
P21554
Residue:
472
  
Inhibitor
Name:
BDBM259996
Synonyms:
US9512132, 32
Type:
Small organic molecule
Emp. Form.:
C19H23ClN6O
Mol. Mass.:
386.879
SMILES:
CC(C)(C)c1nc(N2CC[C@H](O)C2)c2cnn(Cc3ncccc3Cl)c2n1
: