Target
Cannabinoid receptor 2
Ligand
BDBM259998
Substrate
Meas. Tech.
cAMP Assay
Temperature
310.15±n/a K
EC50
5.0±n/a nM
Comments
extracted
Citation
 Grether, UKimbara, ANettekoven, MRicklin, FRoever, SRogers-Evans, MSchulz-Gasch, T Pyrazol derivatives US Patent  US9694012 Publication Date 7/4/2017 
Target
Name:
Cannabinoid receptor 2
Synonyms:
CANNABINOID CB2 CB2 CB2B CNR2_HUMAN Cannabinoid CB2 receptor Cannabinoid receptor 2 (CB2R) | hCB2
Type:
G Protein-Coupled Receptor (GPCR)
Mol. Mass.:
39690.94
Organism:
Homo sapiens (Human)
Description:
P34972
Residue:
360
  
Inhibitor
Name:
BDBM259998
Synonyms:
US9512132, 34
Type:
Small organic molecule
Emp. Form.:
C22H26F3N5O
Mol. Mass.:
433.4699
SMILES:
CC(C)(C)c1nc(N2CCC[C@@H]2CO)c2cnn(Cc3ccccc3C(F)(F)F)c2n1
: