Target
Caspase-1
Ligand
BDBM224
Substrate
Caspase-1 Fluorogenic Substrate Ac-Trp-Glu-His-Asp-AFC
Meas. Tech.
Fluorometric Assay
pH
7.4±n/a
Temperature
298.15±n/a K
Ki
8300±n/a nM
Citation
 Choong, ICLew, WLee, DPham, PBurdett, MTLam, JWWiesmann, CLuong, TNFahr, BDeLano, WLMcDowell, RSAllen, DAErlanson, DAGordon, EMO'Brien, T Identification of potent and selective small-molecule inhibitors of caspase-3 through the use of extended tethering and structure-based drug design. J Med Chem 45:5005-22 (2002)  
Target
Name:
Caspase-1
Synonyms:
CASP1 Caspase ICE IL1BCE Interleukin-1 beta-converting enzyme
Type:
Enzyme
Mol. Mass.:
45154.13
Organism:
Homo sapiens (Human)
Description:
P29466
Residue:
404
  
Inhibitor
Name:
BDBM224
Synonyms:
(S)-5-({5-[1-Carboxymethyl-3-(2-chloro-benzylsulfanyl)-2-oxo-propylcarbamoyl]thiazol-2-hydroxy-benzoic Acidylmethyl}sulfamoyl)-2- Heterocyclic deriv. 64b | Inhibitor 64b
Type:
Small organic molecule
Emp. Form.:
C24H22ClN3O9S3
Mol. Mass.:
628.094
SMILES:
OC(=O)C[C@H](NC(=O)c1cnc(CNS(=O)(=O)c2ccc(O)c(c2)C(O)=O)s1)C(=O)CSCc1ccccc1Cl
:
Substrate
Name:
Caspase-1 Fluorogenic Substrate Ac-Trp-Glu-His-Asp-AFC
Synonyms:
Caspase-4 Fluorometric Substrate Ac-Trp-Glu-His-Asp-AFC | Caspase-5 Fluorometric Substrate Ac-Trp-Glu-His-Asp-AFC
Type:
Peptide
Mol. Mass.:
584.05
Organism:
Description:
Molecular Mass of WEHD
Residue:
4
WEHD