Target
Caspase-3
Ligand
BDBM231
Substrate
Caspase-3 Fluorogenic Substrate
Meas. Tech.
Fluorometric Assay
pH
7.4±n/a
Temperature
298.15±n/a K
Ki
160±n/a nM
Citation
 Choong, ICLew, WLee, DPham, PBurdett, MTLam, JWWiesmann, CLuong, TNFahr, BDeLano, WLMcDowell, RSAllen, DAErlanson, DAGordon, EMO'Brien, T Identification of potent and selective small-molecule inhibitors of caspase-3 through the use of extended tethering and structure-based drug design. J Med Chem 45:5005-22 (2002)  
Target
Name:
Caspase-3
Synonyms:
Apopain CASP3 CPP-32 Caspase 3 Caspase-3 subunit p17 SCA-1 Yama protein | caspase-3 preproprotein
Type:
Hydrolase; heterotetramer of two heterodimers
Mol. Mass.:
31607.55
Organism:
Homo sapiens (Human)
Description:
Residue:
277
  
Inhibitor
Name:
BDBM231
Synonyms:
(S)-5-{[3-(1-Carboxymethyl-2-oxo-ethylcarbamoyl)is-oxazol-5-ylmethyl]sulfamoyl}-2-hydroxy-benzoic Acid Heterocyclic deriv. 65a | Inhibitor 65a
Type:
Small organic molecule
Emp. Form.:
C16H15N3O10S
Mol. Mass.:
441.369
SMILES:
OC(=O)C[C@H](NC(=O)c1cc(CNS(=O)(=O)c2ccc(O)c(c2)C(O)=O)on1)C=O
:
Substrate
Name:
Caspase-3 Fluorogenic Substrate
Synonyms:
Caspase-3 Fluorogenic Substrate Ac-Asp-Glu-Val-Asp-AFC | Fluorometric Tetrapeptide Ac-DEVD-AMC
Type:
Mol. Mass.:
1477.75
Organism:
Description:
AFC = 7-Amino-4-trifluoromethylcoumarin
Residue:
16
ACASPGLVALASPAFC