Target
Caspase-6
Ligand
BDBM222
Substrate
Caspase-6 Fluorometric Substrate Ac-Val-Glu-Ile-Asp-AFC
Meas. Tech.
Fluorometric Assay
pH
7.4±n/a
Temperature
298.15±n/a K
Ki
120±n/a nM
Citation
 Choong, ICLew, WLee, DPham, PBurdett, MTLam, JWWiesmann, CLuong, TNFahr, BDeLano, WLMcDowell, RSAllen, DAErlanson, DAGordon, EMO'Brien, T Identification of potent and selective small-molecule inhibitors of caspase-3 through the use of extended tethering and structure-based drug design. J Med Chem 45:5005-22 (2002)  
Target
Name:
Caspase-6
Synonyms:
Apoptotic protease Mch-2 CASP6 Caspase | MCH2
Type:
Enzyme
Mol. Mass.:
33312.62
Organism:
Homo sapiens (Human)
Description:
P55212
Residue:
293
  
Inhibitor
Name:
BDBM222
Synonyms:
(S)-5-({5-[1-Carboxymethyl-3-(2-chloro-benzylsulfanyl)-2-oxo-propylcarbamoyl]pyridin-2-ylmethyl}sulfamoyl)-2-hydroxy-benzoic Acid Pyridine Scaffold 59
Type:
Small organic molecule
Emp. Form.:
C26H24ClN3O9S2
Mol. Mass.:
622.066
SMILES:
OC(=O)C[C@H](NC(=O)c1ccc(CNS(=O)(=O)c2ccc(O)c(c2)C(O)=O)nc1)C(=O)CSCc1ccccc1Cl
:
Substrate
Name:
Caspase-6 Fluorometric Substrate Ac-Val-Glu-Ile-Asp-AFC
Synonyms:
Type:
Peptide
Mol. Mass.:
472.49
Organism:
Description:
Molecular Mass of VEID
Residue:
4
VEID