Target
Caspase-5
Ligand
BDBM223
Substrate
Caspase-1 Fluorogenic Substrate Ac-Trp-Glu-His-Asp-AFC
Meas. Tech.
Fluorometric Assay
pH
7.4±n/a
Temperature
298.15±n/a K
Ki
32000±n/a nM
Citation
 Choong, ICLew, WLee, DPham, PBurdett, MTLam, JWWiesmann, CLuong, TNFahr, BDeLano, WLMcDowell, RSAllen, DAErlanson, DAGordon, EMO'Brien, T Identification of potent and selective small-molecule inhibitors of caspase-3 through the use of extended tethering and structure-based drug design. J Med Chem 45:5005-22 (2002)  
Target
Name:
Caspase-5
Synonyms:
CASP-5 CASP5_HUMAN Caspase-5 subunit p10 ICE(rel)-III ICH3 Protease TY | TY protease
Type:
Enzyme
Mol. Mass.:
49760.80
Organism:
Homo sapiens (Human)
Description:
P51878
Residue:
434
  
Inhibitor
Name:
BDBM223
Synonyms:
(S)-5-({5-[1-Carboxymethyl-3-(2-chloro-benzylsulfanyl)-2-oxo-propylcarbamoyl]pyrimidin-2-ylmethyl}sulfamoyl)-2-hydroxy-benzoic Acid Heterocyclic deriv. 62b | Inhibitor 62b
Type:
Small organic molecule
Emp. Form.:
C25H23ClN4O9S2
Mol. Mass.:
623.055
SMILES:
OC(=O)C[C@H](NC(=O)c1cnc(CNS(=O)(=O)c2ccc(O)c(c2)C(O)=O)nc1)C(=O)CSCc1ccccc1Cl
:
Substrate
Name:
Caspase-1 Fluorogenic Substrate Ac-Trp-Glu-His-Asp-AFC
Synonyms:
Caspase-4 Fluorometric Substrate Ac-Trp-Glu-His-Asp-AFC | Caspase-5 Fluorometric Substrate Ac-Trp-Glu-His-Asp-AFC
Type:
Peptide
Mol. Mass.:
584.05
Organism:
Description:
Molecular Mass of WEHD
Residue:
4
WEHD