Target
Caspase-8
Ligand
BDBM227
Substrate
Caspase-8 Fluorometric Substrate Ac-Ile-Glu-Thr-Asp-AFC
Meas. Tech.
Fluorometric Assay
pH
7.4±n/a
Temperature
298.15±n/a K
Ki
710±n/a nM
Citation
 Choong, ICLew, WLee, DPham, PBurdett, MTLam, JWWiesmann, CLuong, TNFahr, BDeLano, WLMcDowell, RSAllen, DAErlanson, DAGordon, EMO'Brien, T Identification of potent and selective small-molecule inhibitors of caspase-3 through the use of extended tethering and structure-based drug design. J Med Chem 45:5005-22 (2002)  
Target
Name:
Caspase-8
Synonyms:
Apoptotic cysteine protease CAP4 CASP8 Caspase Caspase-8 subunit p18 FADD-like ICE ICE-like apoptotic protease 5 MCH5 | MORT1-associated CED-3 homolog
Type:
Enzyme
Mol. Mass.:
55373.89
Organism:
Homo sapiens (Human)
Description:
Q14790
Residue:
479
  
Inhibitor
Name:
BDBM227
Synonyms:
(S)-5-({5-[1-Carboxymethyl-3-(2-chloro-benzylsulfanyl)-2-oxo-propylcarbamoyl]-4-methyl-thiophen-2-ylmethyl}-sulfamoyl)-2-hydroxy-benzoic Acid Heterocyclic deriv. 69b | Inhibitor 69b
Type:
Small organic molecule
Emp. Form.:
C26H25ClN2O9S3
Mol. Mass.:
641.133
SMILES:
Cc1cc(CNS(=O)(=O)c2ccc(O)c(c2)C(O)=O)sc1C(=O)N[C@@H](CC(O)=O)C(=O)CSCc1ccccc1Cl
:
Substrate
Name:
Caspase-8 Fluorometric Substrate Ac-Ile-Glu-Thr-Asp-AFC
Synonyms:
Type:
Peptide
Mol. Mass.:
474.46
Organism:
Description:
Molecular Mass of IETD
Residue:
4
IETD