Target
Phosphatidylinositol 4,5-bisphosphate 3-kinase catalytic subunit delta isoform
Ligand
BDBM261189
Substrate
Meas. Tech.
Scintillation Proximity Assay
IC50
<10±n/a nM
Citation
 Li, YCombs, APYue, EWMei, SDouty, B Use of pyrazolopyrimidine derivatives for the treatment of PI3K-delta related disorders US Patent  US9932341 Publication Date 4/3/2018 
Target
Name:
Phosphatidylinositol 4,5-bisphosphate 3-kinase catalytic subunit delta isoform
Synonyms:
PI3-kinase p110 subunit delta PI3-kinase subunit p110-delta PIK3CD Phosphatidylinositol 4,5-biphosphate 3-kinase catalytic subunit delta (PIK3CD) Phosphatidylinositol 4,5-bisphosphate 3-kinase 110 kDa catalytic subunit delta (PI3K delta) Phosphatidylinositol 4,5-bisphosphate 3-kinase catalytic subunit delta (PI3Kdelta) Phosphatidylinositol 4,5-bisphosphate 3-kinase catalytic subunit delta isoform (PI3K delta) Phosphatidylinositol 4,5-bisphosphate 3-kinase catalytic subunit delta isoform (PI3K-delta) Phosphatidylinositol 4,5-bisphosphate 3-kinase catalytic subunit delta isoform (PI3Kdelta)
Type:
Enzyme Subunit
Mol. Mass.:
119489.41
Organism:
Homo sapiens (Human)
Description:
O00329
Residue:
1044
  
Inhibitor
Name:
BDBM261189
Synonyms:
4-[1-(4-Amino-3-methyl-1H-pyrazolo[3,4-d]pyrimidin-1-yl)ethyl]-2-azetidin-3-yl-6-chloro-3-ethoxybenzonitrile US10646492, Example 212 US9707233, 212 US9932341, Example 212
Type:
Small organic molecule
Emp. Form.:
C20H22ClN7O
Mol. Mass.:
411.888
SMILES:
CCOc1c(cc(Cl)c(C#N)c1C1CNC1)C(C)n1nc(C)c2c(N)ncnc12
: